{"text_format":"1","workbook":"xlsx","n_sheets":17,"sheets":["Nómina","D1","D2","D3","D4","D5","D6","D7","D8","D9","D10","D11","D12","D13","D14","D15","D16"],"not_rendered":{"charts":0,"images":3,"macros":1,"external_links":0,"defined_names":1,"comments":0,"pivot_tables":0},"unopened":[],"bounds":{"document_bytes":16777216,"sheet_cells":100000,"rows_first":2000,"rows_last":500,"rows_between":2000,"halvings":0,"cell_chars":16384,"cell_head_chars":4096},"cells_cut":0,"cells_raw":0,"read":"whole","date_system":"1900"}

{"sheet":"Nómina","index":0,"n_rows":35,"n_cols":12,"rows_kept":35,"cut":false,"hidden":false,"merged":[[1,0,1,12],[2,0,2,12],[5,0,5,12],[7,3,7,6],[17,11,17,12],[16,11,16,12],[15,11,15,12],[14,11,14,12],[13,11,13,12],[12,11,12,12],[7,1,7,2],[11,11,11,12],[10,11,10,12],[9,11,9,12],[33,9,33,11],[34,9,34,11],[18,11,18,12],[32,9,32,11],[34,2,34,3],[32,2,32,3],[33,2,33,3],[27,10,27,12],[23,11,23,12],[22,11,22,12],[21,11,21,12],[20,11,20,12],[19,11,19,12],[25,11,25,12],[24,11,24,12]]}
[]
[]
[]
[]
[]
["NÓMINA DE INSCRIPCIÓN DE DEPORTISTAS"]
[]
[null,"Institución Educativa:"]
[null,null,null,null,null,null,""]
["N°","APELLIDO PATERNO","APELLIDO MATERNO","NOMBRES","N° DNI","FECHA DE NACIMIENTO","INSTITUCIÓN EDUCATIVA","CARGO","CONDICIÓN LABORAL","DOCUMENTO QUE ACREDITA VÍNCULO LABORAL","Nro.","INSTITUCIÓN EDUCATIVA EN CASO DE DEPORTISTA INVITADO"]
[1,null,null,null,null,null,{"$f":"IF($D$8=\"\",\" \",$D$8)","v":" "}]
[2,null,null,null,null,null,{"$f":"IF($D$8=\"\",\" \",$D$8)","v":" "}]
[3,null,null,null,null,null,{"$f":"IF($D$8=\"\",\" \",$D$8)","v":" "}]
[4,null,null,null,null,null," "]
[5,null,null,null,null,null," "]
[6,null,null,null,null,null," "]
[7,null,null,null,null,null," "]
[8,null,null,null,null,null," "]
[9,null,null,null,null,null," "]
[10,null,null,null,null,null," "]
[11,null,null,null,null,null," "]
[12,null,null,null,null,null," "]
[13,null,null,null,null,null," "]
[14,null,null,null,null,null," "]
[15,null,null,null,null,null," "]
[16,null,null,null,null,null," "]
[]
[null,null,null,null,null,null,null,null,null,null,{"$f":"CONCATENATE(\"Puno, \",TEXT(TODAY(),\"dddd dd mmmm\"),\" del \",TEXT(TODAY(),\"yyy\"))","v":"Puno, miércoles 08 Mayo del 2019"}]
[]
[]
[]
[]
[null,null,"____________________________________",null,null,null,"____________________________________",null,null,"____________________________________"]
[null,null,"PRESIDENTE DEL EQUIPO",null,null,null,"DELEGADO DEL EQUIPO",null,null,"V°B° DIRECTOR DE IE"]
[null,null,"Yo",null,null,null,"Tú",null,null,"Él"]

{"sheet":"D1","index":1,"n_rows":40,"n_cols":8,"rows_kept":40,"cut":false,"hidden":true,"merged":[[7,1,7,7],[1,1,1,7],[2,1,2,7],[4,1,4,7],[5,1,5,3],[5,4,5,7],[8,1,8,2],[8,3,8,5],[9,1,9,2],[9,3,9,5],[10,1,10,2],[10,3,10,5],[25,3,25,5],[11,1,11,2],[11,3,11,5],[13,1,13,7],[14,1,14,2],[14,3,14,7],[15,1,15,2],[15,3,15,7],[16,1,16,2],[16,3,16,5],[18,1,18,3],[19,1,19,3],[19,4,19,7],[26,3,26,5],[27,3,27,5],[31,1,31,3],[31,5,31,7],[32,1,32,3],[32,5,32,7],[33,1,33,3],[33,5,33,7],[37,3,37,5],[38,3,38,5],[39,3,39,5]]}
[]
[]
[]
[]
[null,"FICHA DE INSCRIPCIÓN DE DEPORTISTA"]
[null,"INSTITUCIÓN EDUCATIVA:",null,null,{"$f":"UPPER(IF(Nómina!$D$8=\"\",\" \",Nómina!$D$8))","v":" "}]
[]
[null,"DATOS DEL DEPORTISTA"]
[null,"DNI N°:",null,{"$f":"IF(Nómina!E11=\"\",\" \",Nómina!E11)","v":" "}]
[null,"APELLIDOS:",null,{"$f":"CONCATENATE(Nómina!B11,\" \",Nómina!C11)","v":" "}]
[null,"NOMBRES:",null,{"$f":"IF(Nómina!D11=\"\",\" \",Nómina!D11)","v":" "}]
[null,"FECHA DE NACIMIENTO:",null,{"$f":"IF(Nómina!F11=\"\",\" \",Nómina!F11)","v":" "}]
[]
[null,"DATOS LABORALES DEL DEPORTISTA"]
[null,"CARGO:",null,{"$f":"UPPER(IF(Nómina!H11=\"\",\" \",Nómina!H11))","v":" "}]
[null,"CONDICIÓN LABORAL:",null,{"$f":"UPPER(IF(Nómina!I11=\"\",\" \",Nómina!I11))","v":" "}]
[null,"DOCUMENTO QUE ACREDITA VÍNCULO LABORAL",null,{"$f":"UPPER(IF(Nómina!J11=\"\",\" \",Nómina!J11))","v":" "},null,null,"N°:",{"$f":"UPPER(IF(Nómina!K11=\"\",\" \",Nómina!K11))","v":" "}]
[]
[null,"En caso de ser deportista invitado:"]
[null,"INSTITUCIÓN EDUCATIVA:",null,null,{"$f":"UPPER(IF(Nómina!L11=\"\",\" \",Nómina!L11))","v":" "}]
[]
[null,null,null,null,null,null,null,{"$f":"CONCATENATE(\"Puno, \",TEXT(TODAY(),\"dddd dd mmmm\"),\" del \",TEXT(TODAY(),\"yyy\"))","v":"Puno, miércoles 08 Mayo del 2019"}]
[]
[]
[]
[null,null,null,"______________________"]
[null,null,null,"Deportista"]
[null,null,null,{"$f":"PROPER(CONCATENATE(Nómina!D11,\" \",Nómina!B11,\" \",Nómina!C11))","v":"  "}]
[]
[]
[]
[null,"______________________",null,null,null,"______________________"]
[null,"Presidente del equipo",null,null,null,"Delegado del equipo"]
[null,{"$f":"PROPER(IF(Nómina!C35=\"\",\" \",Nómina!C35))","v":"Yo"},null,null,null,{"$f":"PROPER(IF(Nómina!G35=\"\",\" \",Nómina!G35))","v":"Tú"}]
[]
[]
[]
[null,null,null,"______________________"]
[null,null,null,"V°B° Director de IE"]
[null,null,null,{"$f":"PROPER(IF(Nómina!J35=\"\",\" \",Nómina!J35))","v":"Él"}]

{"sheet":"D2","index":2,"n_rows":40,"n_cols":8,"rows_kept":40,"cut":false,"hidden":true,"merged":[[10,3,10,5],[1,1,1,7],[2,1,2,7],[15,3,15,7],[16,3,16,5],[5,4,5,7],[5,1,5,3],[9,3,9,5],[8,3,8,5],[19,1,19,3],[19,4,19,7],[13,1,13,7],[14,3,14,7],[11,3,11,5],[18,1,18,3],[39,3,39,5],[4,1,4,7],[11,1,11,2],[10,1,10,2],[9,1,9,2],[8,1,8,2],[16,1,16,2],[15,1,15,2],[14,1,14,2],[7,1,7,7],[33,1,33,3],[25,3,25,5],[26,3,26,5],[27,3,27,5],[37,3,37,5],[38,3,38,5],[31,5,31,7],[32,5,32,7],[33,5,33,7],[31,1,31,3],[32,1,32,3]]}
[]
[]
[]
[]
[null,"FICHA DE INSCRIPCIÓN DE DEPORTISTA"]
[null,"INSTITUCIÓN EDUCATIVA:",null,null,{"$f":"UPPER(IF(Nómina!$D$8=\"\",\" \",Nómina!$D$8))","v":" "}]
[]
[null,"DATOS DEL DEPORTISTA"]
[null,"DNI N°:",null,{"$f":"IF(Nómina!E12=\"\",\" \",Nómina!E12)","v":" "}]
[null,"APELLIDOS:",null,{"$f":"CONCATENATE(Nómina!B12,\" \",Nómina!C12)","v":" "}]
[null,"NOMBRES:",null,{"$f":"IF(Nómina!D12=\"\",\" \",Nómina!D12)","v":" "}]
[null,"FECHA DE NACIMIENTO:",null,{"$f":"IF(Nómina!F12=\"\",\" \",Nómina!F12)","v":" "}]
[]
[null,"DATOS LABORALES DEL DEPORTISTA"]
[null,"CARGO:",null,{"$f":"UPPER(IF(Nómina!H12=\"\",\" \",Nómina!H12))","v":" "}]
[null,"CONDICIÓN LABORAL:",null,{"$f":"UPPER(IF(Nómina!I12=\"\",\" \",Nómina!I12))","v":" "}]
[null,"DOCUMENTO QUE ACREDITA VÍNCULO LABORAL",null,{"$f":"UPPER(IF(Nómina!J12=\"\",\" \",Nómina!J12))","v":" "},null,null,"N°:",{"$f":"UPPER(IF(Nómina!K12=\"\",\" \",Nómina!K12))","v":" "}]
[]
[null,"En caso de ser deportista invitado:"]
[null,"INSTITUCIÓN EDUCATIVA:",null,null,{"$f":"UPPER(IF(Nómina!L12=\"\",\" \",Nómina!L12))","v":" "}]
[]
[null,null,null,null,null,null,null,{"$f":"CONCATENATE(\"Puno, \",TEXT(TODAY(),\"dddd dd mmmm\"),\" del \",TEXT(TODAY(),\"yyy\"))","v":"Puno, miércoles 08 Mayo del 2019"}]
[]
[]
[]
[null,null,null,"______________________"]
[null,null,null,"Deportista"]
[null,null,null,{"$f":"PROPER(CONCATENATE(Nómina!D12,\" \",Nómina!B12,\" \",Nómina!C12))","v":"  "}]
[]
[]
[]
[null,"______________________",null,null,null,"______________________"]
[null,"Presidente del equipo",null,null,null,"Delegado del equipo"]
[null,{"$f":"PROPER(IF(Nómina!C35=\"\",\" \",Nómina!C35))","v":"Yo"},null,null,null,{"$f":"PROPER(IF(Nómina!G35=\"\",\" \",Nómina!G35))","v":"Tú"}]
[]
[]
[]
[null,null,null,"______________________"]
[null,null,null,"V°B° Director de IE"]
[null,null,null,{"$f":"PROPER(IF(Nómina!J35=\"\",\" \",Nómina!J35))","v":"Él"}]

{"sheet":"D3","index":3,"n_rows":40,"n_cols":8,"rows_kept":40,"cut":false,"hidden":true,"merged":[[7,1,7,7],[1,1,1,7],[2,1,2,7],[4,1,4,7],[5,1,5,3],[5,4,5,7],[8,1,8,2],[8,3,8,5],[9,1,9,2],[9,3,9,5],[10,1,10,2],[10,3,10,5],[25,3,25,5],[11,1,11,2],[11,3,11,5],[13,1,13,7],[14,1,14,2],[14,3,14,7],[15,1,15,2],[15,3,15,7],[16,1,16,2],[16,3,16,5],[18,1,18,3],[19,1,19,3],[19,4,19,7],[26,3,26,5],[27,3,27,5],[31,1,31,3],[31,5,31,7],[32,1,32,3],[32,5,32,7],[39,3,39,5],[33,1,33,3],[33,5,33,7],[37,3,37,5],[38,3,38,5]]}
[]
[]
[]
[]
[null,"FICHA DE INSCRIPCIÓN DE DEPORTISTA"]
[null,"INSTITUCIÓN EDUCATIVA:",null,null,{"$f":"UPPER(IF(Nómina!$D$8=\"\",\" \",Nómina!$D$8))","v":" "}]
[]
[null,"DATOS DEL DEPORTISTA"]
[null,"DNI N°:",null,{"$f":"IF(Nómina!E13=\"\",\" \",Nómina!E13)","v":" "}]
[null,"APELLIDOS:",null,{"$f":"CONCATENATE(Nómina!B13,\" \",Nómina!C13)","v":" "}]
[null,"NOMBRES:",null,{"$f":"IF(Nómina!D13=\"\",\" \",Nómina!D13)","v":" "}]
[null,"FECHA DE NACIMIENTO:",null,{"$f":"IF(Nómina!F13=\"\",\" \",Nómina!F13)","v":" "}]
[]
[null,"DATOS LABORALES DEL DEPORTISTA"]
[null,"CARGO:",null,{"$f":"UPPER(IF(Nómina!H13=\"\",\" \",Nómina!H13))","v":" "}]
[null,"CONDICIÓN LABORAL:",null,{"$f":"UPPER(IF(Nómina!I13=\"\",\" \",Nómina!I13))","v":" "}]
[null,"DOCUMENTO QUE ACREDITA VÍNCULO LABORAL",null,{"$f":"UPPER(IF(Nómina!J13=\"\",\" \",Nómina!J13))","v":" "},null,null,"N°:",{"$f":"UPPER(IF(Nómina!K13=\"\",\" \",Nómina!K13))","v":" "}]
[]
[null,"En caso de ser deportista invitado:"]
[null,"INSTITUCIÓN EDUCATIVA:",null,null,{"$f":"UPPER(IF(Nómina!L13=\"\",\" \",Nómina!L13))","v":" "}]
[]
[null,null,null,null,null,null,null,{"$f":"CONCATENATE(\"Puno, \",TEXT(TODAY(),\"dddd dd mmmm\"),\" del \",TEXT(TODAY(),\"yyy\"))","v":"Puno, miércoles 08 Mayo del 2019"}]
[]
[]
[]
[null,null,null,"______________________"]
[null,null,null,"Deportista"]
[null,null,null,{"$f":"PROPER(CONCATENATE(Nómina!D13,\" \",Nómina!B13,\" \",Nómina!C13))","v":"  "}]
[]
[]
[]
[null,"______________________",null,null,null,"______________________"]
[null,"Presidente del equipo",null,null,null,"Delegado del equipo"]
[null,{"$f":"PROPER(IF(Nómina!C35=\"\",\" \",Nómina!C35))","v":"Yo"},null,null,null,{"$f":"PROPER(IF(Nómina!G35=\"\",\" \",Nómina!G35))","v":"Tú"}]
[]
[]
[]
[null,null,null,"______________________"]
[null,null,null,"V°B° Director de IE"]
[null,null,null,{"$f":"PROPER(IF(Nómina!J35=\"\",\" \",Nómina!J35))","v":"Él"}]

{"sheet":"D4","index":4,"n_rows":40,"n_cols":8,"rows_kept":40,"cut":false,"hidden":true,"merged":[[7,1,7,7],[1,1,1,7],[2,1,2,7],[4,1,4,7],[5,1,5,3],[5,4,5,7],[8,1,8,2],[8,3,8,5],[9,1,9,2],[9,3,9,5],[10,1,10,2],[10,3,10,5],[25,3,25,5],[11,1,11,2],[11,3,11,5],[13,1,13,7],[14,1,14,2],[14,3,14,7],[15,1,15,2],[15,3,15,7],[16,1,16,2],[16,3,16,5],[18,1,18,3],[19,1,19,3],[19,4,19,7],[26,3,26,5],[27,3,27,5],[31,1,31,3],[31,5,31,7],[32,1,32,3],[32,5,32,7],[33,1,33,3],[33,5,33,7],[37,3,37,5],[38,3,38,5],[39,3,39,5]]}
[]
[]
[]
[]
[null,"FICHA DE INSCRIPCIÓN DE DEPORTISTA"]
[null,"INSTITUCIÓN EDUCATIVA:",null,null,{"$f":"UPPER(IF(Nómina!$D$8=\"\",\" \",Nómina!$D$8))","v":" "}]
[]
[null,"DATOS DEL DEPORTISTA"]
[null,"DNI N°:",null,{"$f":"IF(Nómina!E14=\"\",\" \",Nómina!E14)","v":" "}]
[null,"APELLIDOS:",null,{"$f":"CONCATENATE(Nómina!B14,\" \",Nómina!C14)","v":" "}]
[null,"NOMBRES:",null,{"$f":"IF(Nómina!D14=\"\",\" \",Nómina!D14)","v":" "}]
[null,"FECHA DE NACIMIENTO:",null,{"$f":"IF(Nómina!F14=\"\",\" \",Nómina!F14)","v":" "}]
[]
[null,"DATOS LABORALES DEL DEPORTISTA"]
[null,"CARGO:",null,{"$f":"UPPER(IF(Nómina!H14=\"\",\" \",Nómina!H14))","v":" "}]
[null,"CONDICIÓN LABORAL:",null,{"$f":"UPPER(IF(Nómina!I14=\"\",\" \",Nómina!I14))","v":" "}]
[null,"DOCUMENTO QUE ACREDITA VÍNCULO LABORAL",null,{"$f":"UPPER(IF(Nómina!J14=\"\",\" \",Nómina!J14))","v":" "},null,null,"N°:",{"$f":"UPPER(IF(Nómina!K14=\"\",\" \",Nómina!K14))","v":" "}]
[]
[null,"En caso de ser deportista invitado:"]
[null,"INSTITUCIÓN EDUCATIVA:",null,null,{"$f":"UPPER(IF(Nómina!L14=\"\",\" \",Nómina!L14))","v":" "}]
[]
[null,null,null,null,null,null,null,{"$f":"CONCATENATE(\"Puno, \",TEXT(TODAY(),\"dddd dd mmmm\"),\" del \",TEXT(TODAY(),\"yyy\"))","v":"Puno, miércoles 08 Mayo del 2019"}]
[]
[]
[]
[null,null,null,"______________________"]
[null,null,null,"Deportista"]
[null,null,null,{"$f":"PROPER(CONCATENATE(Nómina!D14,\" \",Nómina!B14,\" \",Nómina!C14))","v":"  "}]
[]
[]
[]
[null,"______________________",null,null,null,"______________________"]
[null,"Presidente del equipo",null,null,null,"Delegado del equipo"]
[null,{"$f":"PROPER(IF(Nómina!C35=\"\",\" \",Nómina!C35))","v":"Yo"},null,null,null,{"$f":"PROPER(IF(Nómina!G35=\"\",\" \",Nómina!G35))","v":"Tú"}]
[]
[]
[]
[null,null,null,"______________________"]
[null,null,null,"V°B° Director de IE"]
[null,null,null,{"$f":"PROPER(IF(Nómina!J35=\"\",\" \",Nómina!J35))","v":"Él"}]

{"sheet":"D5","index":5,"n_rows":40,"n_cols":8,"rows_kept":40,"cut":false,"hidden":true,"merged":[[7,1,7,7],[1,1,1,7],[2,1,2,7],[4,1,4,7],[5,1,5,3],[5,4,5,7],[8,1,8,2],[8,3,8,5],[9,1,9,2],[9,3,9,5],[10,1,10,2],[10,3,10,5],[25,3,25,5],[11,1,11,2],[11,3,11,5],[13,1,13,7],[14,1,14,2],[14,3,14,7],[15,1,15,2],[15,3,15,7],[16,1,16,2],[16,3,16,5],[18,1,18,3],[19,1,19,3],[19,4,19,7],[26,3,26,5],[27,3,27,5],[31,1,31,3],[31,5,31,7],[32,1,32,3],[32,5,32,7],[33,1,33,3],[33,5,33,7],[37,3,37,5],[38,3,38,5],[39,3,39,5]]}
[]
[]
[]
[]
[null,"FICHA DE INSCRIPCIÓN DE DEPORTISTA"]
[null,"INSTITUCIÓN EDUCATIVA:",null,null,{"$f":"UPPER(IF(Nómina!$D$8=\"\",\" \",Nómina!$D$8))","v":" "}]
[]
[null,"DATOS DEL DEPORTISTA"]
[null,"DNI N°:",null,{"$f":"IF(Nómina!E15=\"\",\" \",Nómina!E15)","v":" "}]
[null,"APELLIDOS:",null,{"$f":"CONCATENATE(Nómina!B15,\" \",Nómina!C15)","v":" "}]
[null,"NOMBRES:",null,{"$f":"IF(Nómina!D15=\"\",\" \",Nómina!D15)","v":" "}]
[null,"FECHA DE NACIMIENTO:",null,{"$f":"IF(Nómina!F15=\"\",\" \",Nómina!F15)","v":" "}]
[]
[null,"DATOS LABORALES DEL DEPORTISTA"]
[null,"CARGO:",null,{"$f":"UPPER(IF(Nómina!H15=\"\",\" \",Nómina!H15))","v":" "}]
[null,"CONDICIÓN LABORAL:",null,{"$f":"UPPER(IF(Nómina!I15=\"\",\" \",Nómina!I15))","v":" "}]
[null,"DOCUMENTO QUE ACREDITA VÍNCULO LABORAL",null,{"$f":"UPPER(IF(Nómina!J15=\"\",\" \",Nómina!J15))","v":" "},null,null,"N°:",{"$f":"UPPER(IF(Nómina!K15=\"\",\" \",Nómina!K15))","v":" "}]
[]
[null,"En caso de ser deportista invitado:"]
[null,"INSTITUCIÓN EDUCATIVA:",null,null,{"$f":"UPPER(IF(Nómina!L15=\"\",\" \",Nómina!L15))","v":" "}]
[]
[null,null,null,null,null,null,null,{"$f":"CONCATENATE(\"Puno, \",TEXT(TODAY(),\"dddd dd mmmm\"),\" del \",TEXT(TODAY(),\"yyy\"))","v":"Puno, miércoles 08 Mayo del 2019"}]
[]
[]
[]
[null,null,null,"______________________"]
[null,null,null,"Deportista"]
[null,null,null,{"$f":"PROPER(CONCATENATE(Nómina!D15,\" \",Nómina!B15,\" \",Nómina!C15))","v":"  "}]
[]
[]
[]
[null,"______________________",null,null,null,"______________________"]
[null,"Presidente del equipo",null,null,null,"Delegado del equipo"]
[null,{"$f":"PROPER(IF(Nómina!C35=\"\",\" \",Nómina!C35))","v":"Yo"},null,null,null,{"$f":"PROPER(IF(Nómina!G35=\"\",\" \",Nómina!G35))","v":"Tú"}]
[]
[]
[]
[null,null,null,"______________________"]
[null,null,null,"V°B° Director de IE"]
[null,null,null,{"$f":"PROPER(IF(Nómina!J35=\"\",\" \",Nómina!J35))","v":"Él"}]

{"sheet":"D6","index":6,"n_rows":40,"n_cols":8,"rows_kept":40,"cut":false,"hidden":true,"merged":[[7,1,7,7],[1,1,1,7],[2,1,2,7],[4,1,4,7],[5,1,5,3],[5,4,5,7],[8,1,8,2],[8,3,8,5],[9,1,9,2],[9,3,9,5],[10,1,10,2],[10,3,10,5],[25,3,25,5],[11,1,11,2],[11,3,11,5],[13,1,13,7],[14,1,14,2],[14,3,14,7],[15,1,15,2],[15,3,15,7],[16,1,16,2],[16,3,16,5],[18,1,18,3],[19,1,19,3],[19,4,19,7],[26,3,26,5],[27,3,27,5],[31,1,31,3],[31,5,31,7],[32,1,32,3],[32,5,32,7],[33,1,33,3],[33,5,33,7],[37,3,37,5],[38,3,38,5],[39,3,39,5]]}
[]
[]
[]
[]
[null,"FICHA DE INSCRIPCIÓN DE DEPORTISTA"]
[null,"INSTITUCIÓN EDUCATIVA:",null,null,{"$f":"UPPER(IF(Nómina!$D$8=\"\",\" \",Nómina!$D$8))","v":" "}]
[]
[null,"DATOS DEL DEPORTISTA"]
[null,"DNI N°:",null,{"$f":"IF(Nómina!E16=\"\",\" \",Nómina!E16)","v":" "}]
[null,"APELLIDOS:",null,{"$f":"CONCATENATE(Nómina!B16,\" \",Nómina!C16)","v":" "}]
[null,"NOMBRES:",null,{"$f":"IF(Nómina!D16=\"\",\" \",Nómina!D16)","v":" "}]
[null,"FECHA DE NACIMIENTO:",null,{"$f":"IF(Nómina!F16=\"\",\" \",Nómina!F16)","v":" "}]
[]
[null,"DATOS LABORALES DEL DEPORTISTA"]
[null,"CARGO:",null,{"$f":"UPPER(IF(Nómina!H16=\"\",\" \",Nómina!H16))","v":" "}]
[null,"CONDICIÓN LABORAL:",null,{"$f":"UPPER(IF(Nómina!I16=\"\",\" \",Nómina!I16))","v":" "}]
[null,"DOCUMENTO QUE ACREDITA VÍNCULO LABORAL",null,{"$f":"UPPER(IF(Nómina!J16=\"\",\" \",Nómina!J16))","v":" "},null,null,"N°:",{"$f":"UPPER(IF(Nómina!K16=\"\",\" \",Nómina!K16))","v":" "}]
[]
[null,"En caso de ser deportista invitado:"]
[null,"INSTITUCIÓN EDUCATIVA:",null,null,{"$f":"UPPER(IF(Nómina!L16=\"\",\" \",Nómina!L16))","v":" "}]
[]
[null,null,null,null,null,null,null,{"$f":"CONCATENATE(\"Puno, \",TEXT(TODAY(),\"dddd dd mmmm\"),\" del \",TEXT(TODAY(),\"yyy\"))","v":"Puno, miércoles 08 Mayo del 2019"}]
[]
[]
[]
[null,null,null,"______________________"]
[null,null,null,"Deportista"]
[null,null,null,{"$f":"PROPER(CONCATENATE(Nómina!D16,\" \",Nómina!B16,\" \",Nómina!C16))","v":"  "}]
[]
[]
[]
[null,"______________________",null,null,null,"______________________"]
[null,"Presidente del equipo",null,null,null,"Delegado del equipo"]
[null,{"$f":"PROPER(IF(Nómina!C35=\"\",\" \",Nómina!C35))","v":"Yo"},null,null,null,{"$f":"PROPER(IF(Nómina!G35=\"\",\" \",Nómina!G35))","v":"Tú"}]
[]
[]
[]
[null,null,null,"______________________"]
[null,null,null,"V°B° Director de IE"]
[null,null,null,{"$f":"PROPER(IF(Nómina!J35=\"\",\" \",Nómina!J35))","v":"Él"}]

{"sheet":"D7","index":7,"n_rows":40,"n_cols":8,"rows_kept":40,"cut":false,"hidden":true,"merged":[[7,1,7,7],[1,1,1,7],[2,1,2,7],[4,1,4,7],[5,1,5,3],[5,4,5,7],[8,1,8,2],[8,3,8,5],[9,1,9,2],[9,3,9,5],[10,1,10,2],[10,3,10,5],[25,3,25,5],[11,1,11,2],[11,3,11,5],[13,1,13,7],[14,1,14,2],[14,3,14,7],[15,1,15,2],[15,3,15,7],[16,1,16,2],[16,3,16,5],[18,1,18,3],[19,1,19,3],[19,4,19,7],[26,3,26,5],[27,3,27,5],[31,1,31,3],[31,5,31,7],[32,1,32,3],[32,5,32,7],[39,3,39,5],[33,1,33,3],[33,5,33,7],[37,3,37,5],[38,3,38,5]]}
[]
[]
[]
[]
[null,"FICHA DE INSCRIPCIÓN DE DEPORTISTA"]
[null,"INSTITUCIÓN EDUCATIVA:",null,null,{"$f":"UPPER(IF(Nómina!$D$8=\"\",\" \",Nómina!$D$8))","v":" "}]
[]
[null,"DATOS DEL DEPORTISTA"]
[null,"DNI N°:",null,{"$f":"IF(Nómina!E17=\"\",\" \",Nómina!E17)","v":" "}]
[null,"APELLIDOS:",null,{"$f":"CONCATENATE(Nómina!B17,\" \",Nómina!C17)","v":" "}]
[null,"NOMBRES:",null,{"$f":"IF(Nómina!D17=\"\",\" \",Nómina!D17)","v":" "}]
[null,"FECHA DE NACIMIENTO:",null,{"$f":"IF(Nómina!F17=\"\",\" \",Nómina!F17)","v":" "}]
[]
[null,"DATOS LABORALES DEL DEPORTISTA"]
[null,"CARGO:",null,{"$f":"UPPER(IF(Nómina!H17=\"\",\" \",Nómina!H17))","v":" "}]
[null,"CONDICIÓN LABORAL:",null,{"$f":"UPPER(IF(Nómina!I17=\"\",\" \",Nómina!I17))","v":" "}]
[null,"DOCUMENTO QUE ACREDITA VÍNCULO LABORAL",null,{"$f":"UPPER(IF(Nómina!J17=\"\",\" \",Nómina!J17))","v":" "},null,null,"N°:",{"$f":"UPPER(IF(Nómina!K17=\"\",\" \",Nómina!K17))","v":" "}]
[]
[null,"En caso de ser deportista invitado:"]
[null,"INSTITUCIÓN EDUCATIVA:",null,null,{"$f":"UPPER(IF(Nómina!L17=\"\",\" \",Nómina!L17))","v":" "}]
[]
[null,null,null,null,null,null,null,{"$f":"CONCATENATE(\"Puno, \",TEXT(TODAY(),\"dddd dd mmmm\"),\" del \",TEXT(TODAY(),\"yyy\"))","v":"Puno, miércoles 08 Mayo del 2019"}]
[]
[]
[]
[null,null,null,"______________________"]
[null,null,null,"Deportista"]
[null,null,null,{"$f":"PROPER(CONCATENATE(Nómina!D17,\" \",Nómina!B17,\" \",Nómina!C17))","v":"  "}]
[]
[]
[]
[null,"______________________",null,null,null,"______________________"]
[null,"Presidente del equipo",null,null,null,"Delegado del equipo"]
[null,{"$f":"PROPER(IF(Nómina!C35=\"\",\" \",Nómina!C35))","v":"Yo"},null,null,null,{"$f":"PROPER(IF(Nómina!G35=\"\",\" \",Nómina!G35))","v":"Tú"}]
[]
[]
[]
[null,null,null,"______________________"]
[null,null,null,"V°B° Director de IE"]
[null,null,null,{"$f":"PROPER(IF(Nómina!J35=\"\",\" \",Nómina!J35))","v":"Él"}]

{"sheet":"D8","index":8,"n_rows":40,"n_cols":8,"rows_kept":40,"cut":false,"hidden":true,"merged":[[7,1,7,7],[1,1,1,7],[2,1,2,7],[4,1,4,7],[5,1,5,3],[5,4,5,7],[8,1,8,2],[8,3,8,5],[9,1,9,2],[9,3,9,5],[10,1,10,2],[10,3,10,5],[25,3,25,5],[11,1,11,2],[11,3,11,5],[13,1,13,7],[14,1,14,2],[14,3,14,7],[15,1,15,2],[15,3,15,7],[16,1,16,2],[16,3,16,5],[18,1,18,3],[19,1,19,3],[19,4,19,7],[26,3,26,5],[27,3,27,5],[31,1,31,3],[31,5,31,7],[32,1,32,3],[32,5,32,7],[33,1,33,3],[33,5,33,7],[37,3,37,5],[38,3,38,5],[39,3,39,5]]}
[]
[]
[]
[]
[null,"FICHA DE INSCRIPCIÓN DE DEPORTISTA"]
[null,"INSTITUCIÓN EDUCATIVA:",null,null,{"$f":"UPPER(IF(Nómina!$D$8=\"\",\" \",Nómina!$D$8))","v":" "}]
[]
[null,"DATOS DEL DEPORTISTA"]
[null,"DNI N°:",null,{"$f":"IF(Nómina!E18=\"\",\" \",Nómina!E18)","v":" "}]
[null,"APELLIDOS:",null,{"$f":"CONCATENATE(Nómina!B18,\" \",Nómina!C18)","v":" "}]
[null,"NOMBRES:",null,{"$f":"IF(Nómina!D18=\"\",\" \",Nómina!D18)","v":" "}]
[null,"FECHA DE NACIMIENTO:",null,{"$f":"IF(Nómina!F18=\"\",\" \",Nómina!F18)","v":" "}]
[]
[null,"DATOS LABORALES DEL DEPORTISTA"]
[null,"CARGO:",null,{"$f":"UPPER(IF(Nómina!H18=\"\",\" \",Nómina!H18))","v":" "}]
[null,"CONDICIÓN LABORAL:",null,{"$f":"UPPER(IF(Nómina!I18=\"\",\" \",Nómina!I18))","v":" "}]
[null,"DOCUMENTO QUE ACREDITA VÍNCULO LABORAL",null,{"$f":"UPPER(IF(Nómina!J18=\"\",\" \",Nómina!J18))","v":" "},null,null,"N°:",{"$f":"UPPER(IF(Nómina!K18=\"\",\" \",Nómina!K18))","v":" "}]
[]
[null,"En caso de ser deportista invitado:"]
[null,"INSTITUCIÓN EDUCATIVA:",null,null,{"$f":"UPPER(IF(Nómina!L18=\"\",\" \",Nómina!L18))","v":" "}]
[]
[null,null,null,null,null,null,null,{"$f":"CONCATENATE(\"Puno, \",TEXT(TODAY(),\"dddd dd mmmm\"),\" del \",TEXT(TODAY(),\"yyy\"))","v":"Puno, miércoles 08 Mayo del 2019"}]
[]
[]
[]
[null,null,null,"______________________"]
[null,null,null,"Deportista"]
[null,null,null,{"$f":"PROPER(CONCATENATE(Nómina!D18,\" \",Nómina!B18,\" \",Nómina!C18))","v":"  "}]
[]
[]
[]
[null,"______________________",null,null,null,"______________________"]
[null,"Presidente del equipo",null,null,null,"Delegado del equipo"]
[null,{"$f":"PROPER(IF(Nómina!C35=\"\",\" \",Nómina!C35))","v":"Yo"},null,null,null,{"$f":"PROPER(IF(Nómina!G35=\"\",\" \",Nómina!G35))","v":"Tú"}]
[]
[]
[]
[null,null,null,"______________________"]
[null,null,null,"V°B° Director de IE"]
[null,null,null,{"$f":"PROPER(IF(Nómina!J35=\"\",\" \",Nómina!J35))","v":"Él"}]

{"sheet":"D9","index":9,"n_rows":40,"n_cols":8,"rows_kept":40,"cut":false,"hidden":true,"merged":[[7,1,7,7],[1,1,1,7],[2,1,2,7],[4,1,4,7],[5,1,5,3],[5,4,5,7],[8,1,8,2],[8,3,8,5],[9,1,9,2],[9,3,9,5],[10,1,10,2],[10,3,10,5],[25,3,25,5],[11,1,11,2],[11,3,11,5],[13,1,13,7],[14,1,14,2],[14,3,14,7],[15,1,15,2],[15,3,15,7],[16,1,16,2],[16,3,16,5],[18,1,18,3],[19,1,19,3],[19,4,19,7],[26,3,26,5],[27,3,27,5],[31,1,31,3],[31,5,31,7],[32,1,32,3],[32,5,32,7],[33,1,33,3],[33,5,33,7],[37,3,37,5],[38,3,38,5],[39,3,39,5]]}
[]
[]
[]
[]
[null,"FICHA DE INSCRIPCIÓN DE DEPORTISTA"]
[null,"INSTITUCIÓN EDUCATIVA:",null,null,{"$f":"UPPER(IF(Nómina!$D$8=\"\",\" \",Nómina!$D$8))","v":" "}]
[]
[null,"DATOS DEL DEPORTISTA"]
[null,"DNI N°:",null,{"$f":"IF(Nómina!E19=\"\",\" \",Nómina!E19)","v":" "}]
[null,"APELLIDOS:",null,{"$f":"CONCATENATE(Nómina!B19,\" \",Nómina!C19)","v":" "}]
[null,"NOMBRES:",null,{"$f":"IF(Nómina!D19=\"\",\" \",Nómina!D19)","v":" "}]
[null,"FECHA DE NACIMIENTO:",null,{"$f":"IF(Nómina!F19=\"\",\" \",Nómina!F19)","v":" "}]
[]
[null,"DATOS LABORALES DEL DEPORTISTA"]
[null,"CARGO:",null,{"$f":"UPPER(IF(Nómina!H19=\"\",\" \",Nómina!H19))","v":" "}]
[null,"CONDICIÓN LABORAL:",null,{"$f":"UPPER(IF(Nómina!I19=\"\",\" \",Nómina!I19))","v":" "}]
[null,"DOCUMENTO QUE ACREDITA VÍNCULO LABORAL",null,{"$f":"UPPER(IF(Nómina!J19=\"\",\" \",Nómina!J19))","v":" "},null,null,"N°:",{"$f":"UPPER(IF(Nómina!K19=\"\",\" \",Nómina!K19))","v":" "}]
[]
[null,"En caso de ser deportista invitado:"]
[null,"INSTITUCIÓN EDUCATIVA:",null,null,{"$f":"UPPER(IF(Nómina!L19=\"\",\" \",Nómina!L19))","v":" "}]
[]
[null,null,null,null,null,null,null,{"$f":"CONCATENATE(\"Puno, \",TEXT(TODAY(),\"dddd dd mmmm\"),\" del \",TEXT(TODAY(),\"yyy\"))","v":"Puno, miércoles 08 Mayo del 2019"}]
[]
[]
[]
[null,null,null,"______________________"]
[null,null,null,"Deportista"]
[null,null,null,{"$f":"PROPER(CONCATENATE(Nómina!D19,\" \",Nómina!B19,\" \",Nómina!C19))","v":"  "}]
[]
[]
[]
[null,"______________________",null,null,null,"______________________"]
[null,"Presidente del equipo",null,null,null,"Delegado del equipo"]
[null,{"$f":"PROPER(IF(Nómina!C35=\"\",\" \",Nómina!C35))","v":"Yo"},null,null,null,{"$f":"PROPER(IF(Nómina!G35=\"\",\" \",Nómina!G35))","v":"Tú"}]
[]
[]
[]
[null,null,null,"______________________"]
[null,null,null,"V°B° Director de IE"]
[null,null,null,{"$f":"PROPER(IF(Nómina!J35=\"\",\" \",Nómina!J35))","v":"Él"}]

{"sheet":"D10","index":10,"n_rows":40,"n_cols":8,"rows_kept":40,"cut":false,"hidden":true,"merged":[[7,1,7,7],[1,1,1,7],[2,1,2,7],[4,1,4,7],[5,1,5,3],[5,4,5,7],[8,1,8,2],[8,3,8,5],[9,1,9,2],[9,3,9,5],[10,1,10,2],[10,3,10,5],[25,3,25,5],[11,1,11,2],[11,3,11,5],[13,1,13,7],[14,1,14,2],[14,3,14,7],[15,1,15,2],[15,3,15,7],[16,1,16,2],[16,3,16,5],[18,1,18,3],[19,1,19,3],[19,4,19,7],[26,3,26,5],[27,3,27,5],[31,1,31,3],[31,5,31,7],[32,1,32,3],[32,5,32,7],[33,1,33,3],[33,5,33,7],[37,3,37,5],[38,3,38,5],[39,3,39,5]]}
[]
[]
[]
[]
[null,"FICHA DE INSCRIPCIÓN DE DEPORTISTA"]
[null,"INSTITUCIÓN EDUCATIVA:",null,null,{"$f":"UPPER(IF(Nómina!$D$8=\"\",\" \",Nómina!$D$8))","v":" "}]
[]
[null,"DATOS DEL DEPORTISTA"]
[null,"DNI N°:",null,{"$f":"IF(Nómina!E20=\"\",\" \",Nómina!E20)","v":" "}]
[null,"APELLIDOS:",null,{"$f":"CONCATENATE(Nómina!B20,\" \",Nómina!C20)","v":" "}]
[null,"NOMBRES:",null,{"$f":"IF(Nómina!D20=\"\",\" \",Nómina!D20)","v":" "}]
[null,"FECHA DE NACIMIENTO:",null,{"$f":"IF(Nómina!F20=\"\",\" \",Nómina!F20)","v":" "}]
[]
[null,"DATOS LABORALES DEL DEPORTISTA"]
[null,"CARGO:",null,{"$f":"UPPER(IF(Nómina!H20=\"\",\" \",Nómina!H20))","v":" "}]
[null,"CONDICIÓN LABORAL:",null,{"$f":"UPPER(IF(Nómina!I20=\"\",\" \",Nómina!I20))","v":" "}]
[null,"DOCUMENTO QUE ACREDITA VÍNCULO LABORAL",null,{"$f":"UPPER(IF(Nómina!J20=\"\",\" \",Nómina!J20))","v":" "},null,null,"N°:",{"$f":"UPPER(IF(Nómina!K20=\"\",\" \",Nómina!K20))","v":" "}]
[]
[null,"En caso de ser deportista invitado:"]
[null,"INSTITUCIÓN EDUCATIVA:",null,null,{"$f":"UPPER(IF(Nómina!L20=\"\",\" \",Nómina!L20))","v":" "}]
[]
[null,null,null,null,null,null,null,{"$f":"CONCATENATE(\"Puno, \",TEXT(TODAY(),\"dddd dd mmmm\"),\" del \",TEXT(TODAY(),\"yyy\"))","v":"Puno, miércoles 08 Mayo del 2019"}]
[]
[]
[]
[null,null,null,"______________________"]
[null,null,null,"Deportista"]
[null,null,null,{"$f":"PROPER(CONCATENATE(Nómina!D20,\" \",Nómina!B20,\" \",Nómina!C20))","v":"  "}]
[]
[]
[]
[null,"______________________",null,null,null,"______________________"]
[null,"Presidente del equipo",null,null,null,"Delegado del equipo"]
[null,{"$f":"PROPER(IF(Nómina!C35=\"\",\" \",Nómina!C35))","v":"Yo"},null,null,null,{"$f":"PROPER(IF(Nómina!G35=\"\",\" \",Nómina!G35))","v":"Tú"}]
[]
[]
[]
[null,null,null,"______________________"]
[null,null,null,"V°B° Director de IE"]
[null,null,null,{"$f":"PROPER(IF(Nómina!J35=\"\",\" \",Nómina!J35))","v":"Él"}]

{"sheet":"D11","index":11,"n_rows":40,"n_cols":8,"rows_kept":40,"cut":false,"hidden":true,"merged":[[7,1,7,7],[1,1,1,7],[2,1,2,7],[4,1,4,7],[5,1,5,3],[5,4,5,7],[8,1,8,2],[8,3,8,5],[9,1,9,2],[9,3,9,5],[10,1,10,2],[10,3,10,5],[25,3,25,5],[11,1,11,2],[11,3,11,5],[13,1,13,7],[14,1,14,2],[14,3,14,7],[15,1,15,2],[15,3,15,7],[16,1,16,2],[16,3,16,5],[18,1,18,3],[19,1,19,3],[19,4,19,7],[26,3,26,5],[27,3,27,5],[31,1,31,3],[31,5,31,7],[32,1,32,3],[32,5,32,7],[39,3,39,5],[33,1,33,3],[33,5,33,7],[37,3,37,5],[38,3,38,5]]}
[]
[]
[]
[]
[null,"FICHA DE INSCRIPCIÓN DE DEPORTISTA"]
[null,"INSTITUCIÓN EDUCATIVA:",null,null,{"$f":"UPPER(IF(Nómina!$D$8=\"\",\" \",Nómina!$D$8))","v":" "}]
[]
[null,"DATOS DEL DEPORTISTA"]
[null,"DNI N°:",null,{"$f":"IF(Nómina!E21=\"\",\" \",Nómina!E21)","v":" "}]
[null,"APELLIDOS:",null,{"$f":"CONCATENATE(Nómina!B21,\" \",Nómina!C21)","v":" "}]
[null,"NOMBRES:",null,{"$f":"IF(Nómina!D21=\"\",\" \",Nómina!D21)","v":" "}]
[null,"FECHA DE NACIMIENTO:",null,{"$f":"IF(Nómina!F21=\"\",\" \",Nómina!F21)","v":" "}]
[]
[null,"DATOS LABORALES DEL DEPORTISTA"]
[null,"CARGO:",null,{"$f":"UPPER(IF(Nómina!H21=\"\",\" \",Nómina!H21))","v":" "}]
[null,"CONDICIÓN LABORAL:",null,{"$f":"UPPER(IF(Nómina!I21=\"\",\" \",Nómina!I21))","v":" "}]
[null,"DOCUMENTO QUE ACREDITA VÍNCULO LABORAL",null,{"$f":"UPPER(IF(Nómina!J21=\"\",\" \",Nómina!J21))","v":" "},null,null,"N°:",{"$f":"UPPER(IF(Nómina!K21=\"\",\" \",Nómina!K21))","v":" "}]
[]
[null,"En caso de ser deportista invitado:"]
[null,"INSTITUCIÓN EDUCATIVA:",null,null,{"$f":"UPPER(IF(Nómina!L21=\"\",\" \",Nómina!L21))","v":" "}]
[]
[null,null,null,null,null,null,null,{"$f":"CONCATENATE(\"Puno, \",TEXT(TODAY(),\"dddd dd mmmm\"),\" del \",TEXT(TODAY(),\"yyy\"))","v":"Puno, miércoles 08 Mayo del 2019"}]
[]
[]
[]
[null,null,null,"______________________"]
[null,null,null,"Deportista"]
[null,null,null,{"$f":"PROPER(CONCATENATE(Nómina!D21,\" \",Nómina!B21,\" \",Nómina!C21))","v":"  "}]
[]
[]
[]
[null,"______________________",null,null,null,"______________________"]
[null,"Presidente del equipo",null,null,null,"Delegado del equipo"]
[null,{"$f":"PROPER(IF(Nómina!C35=\"\",\" \",Nómina!C35))","v":"Yo"},null,null,null,{"$f":"PROPER(IF(Nómina!G35=\"\",\" \",Nómina!G35))","v":"Tú"}]
[]
[]
[]
[null,null,null,"______________________"]
[null,null,null,"V°B° Director de IE"]
[null,null,null,{"$f":"PROPER(IF(Nómina!J35=\"\",\" \",Nómina!J35))","v":"Él"}]

{"sheet":"D12","index":12,"n_rows":40,"n_cols":8,"rows_kept":40,"cut":false,"hidden":true,"merged":[[7,1,7,7],[1,1,1,7],[2,1,2,7],[4,1,4,7],[5,1,5,3],[5,4,5,7],[8,1,8,2],[8,3,8,5],[9,1,9,2],[9,3,9,5],[10,1,10,2],[10,3,10,5],[25,3,25,5],[11,1,11,2],[11,3,11,5],[13,1,13,7],[14,1,14,2],[14,3,14,7],[15,1,15,2],[15,3,15,7],[16,1,16,2],[16,3,16,5],[18,1,18,3],[19,1,19,3],[19,4,19,7],[26,3,26,5],[27,3,27,5],[31,1,31,3],[31,5,31,7],[32,1,32,3],[32,5,32,7],[33,1,33,3],[33,5,33,7],[37,3,37,5],[38,3,38,5],[39,3,39,5]]}
[]
[]
[]
[]
[null,"FICHA DE INSCRIPCIÓN DE DEPORTISTA"]
[null,"INSTITUCIÓN EDUCATIVA:",null,null,{"$f":"UPPER(IF(Nómina!$D$8=\"\",\" \",Nómina!$D$8))","v":" "}]
[]
[null,"DATOS DEL DEPORTISTA"]
[null,"DNI N°:",null,{"$f":"IF(Nómina!E22=\"\",\" \",Nómina!E22)","v":" "}]
[null,"APELLIDOS:",null,{"$f":"CONCATENATE(Nómina!B22,\" \",Nómina!C22)","v":" "}]
[null,"NOMBRES:",null,{"$f":"IF(Nómina!D22=\"\",\" \",Nómina!D22)","v":" "}]
[null,"FECHA DE NACIMIENTO:",null,{"$f":"IF(Nómina!F22=\"\",\" \",Nómina!F22)","v":" "}]
[]
[null,"DATOS LABORALES DEL DEPORTISTA"]
[null,"CARGO:",null,{"$f":"UPPER(IF(Nómina!H22=\"\",\" \",Nómina!H22))","v":" "}]
[null,"CONDICIÓN LABORAL:",null,{"$f":"UPPER(IF(Nómina!I22=\"\",\" \",Nómina!I22))","v":" "}]
[null,"DOCUMENTO QUE ACREDITA VÍNCULO LABORAL",null,{"$f":"UPPER(IF(Nómina!J22=\"\",\" \",Nómina!J22))","v":" "},null,null,"N°:",{"$f":"UPPER(IF(Nómina!K22=\"\",\" \",Nómina!K22))","v":" "}]
[]
[null,"En caso de ser deportista invitado:"]
[null,"INSTITUCIÓN EDUCATIVA:",null,null,{"$f":"UPPER(IF(Nómina!L22=\"\",\" \",Nómina!L22))","v":" "}]
[]
[null,null,null,null,null,null,null,{"$f":"CONCATENATE(\"Puno, \",TEXT(TODAY(),\"dddd dd mmmm\"),\" del \",TEXT(TODAY(),\"yyy\"))","v":"Puno, miércoles 08 Mayo del 2019"}]
[]
[]
[]
[null,null,null,"______________________"]
[null,null,null,"Deportista"]
[null,null,null,{"$f":"PROPER(CONCATENATE(Nómina!D22,\" \",Nómina!B22,\" \",Nómina!C22))","v":"  "}]
[]
[]
[]
[null,"______________________",null,null,null,"______________________"]
[null,"Presidente del equipo",null,null,null,"Delegado del equipo"]
[null,{"$f":"PROPER(IF(Nómina!C35=\"\",\" \",Nómina!C35))","v":"Yo"},null,null,null,{"$f":"PROPER(IF(Nómina!G35=\"\",\" \",Nómina!G35))","v":"Tú"}]
[]
[]
[]
[null,null,null,"______________________"]
[null,null,null,"V°B° Director de IE"]
[null,null,null,{"$f":"PROPER(IF(Nómina!J35=\"\",\" \",Nómina!J35))","v":"Él"}]

{"sheet":"D13","index":13,"n_rows":40,"n_cols":8,"rows_kept":40,"cut":false,"hidden":true,"merged":[[7,1,7,7],[1,1,1,7],[2,1,2,7],[4,1,4,7],[5,1,5,3],[5,4,5,7],[8,1,8,2],[8,3,8,5],[9,1,9,2],[9,3,9,5],[10,1,10,2],[10,3,10,5],[25,3,25,5],[11,1,11,2],[11,3,11,5],[13,1,13,7],[14,1,14,2],[14,3,14,7],[15,1,15,2],[15,3,15,7],[16,1,16,2],[16,3,16,5],[18,1,18,3],[19,1,19,3],[19,4,19,7],[26,3,26,5],[27,3,27,5],[31,1,31,3],[31,5,31,7],[32,1,32,3],[32,5,32,7],[33,1,33,3],[33,5,33,7],[37,3,37,5],[38,3,38,5],[39,3,39,5]]}
[]
[]
[]
[]
[null,"FICHA DE INSCRIPCIÓN DE DEPORTISTA"]
[null,"INSTITUCIÓN EDUCATIVA:",null,null,{"$f":"UPPER(IF(Nómina!$D$8=\"\",\" \",Nómina!$D$8))","v":" "}]
[]
[null,"DATOS DEL DEPORTISTA"]
[null,"DNI N°:",null,{"$f":"IF(Nómina!E23=\"\",\" \",Nómina!E23)","v":" "}]
[null,"APELLIDOS:",null,{"$f":"CONCATENATE(Nómina!B23,\" \",Nómina!C23)","v":" "}]
[null,"NOMBRES:",null,{"$f":"IF(Nómina!D23=\"\",\" \",Nómina!D23)","v":" "}]
[null,"FECHA DE NACIMIENTO:",null,{"$f":"IF(Nómina!F23=\"\",\" \",Nómina!F23)","v":" "}]
[]
[null,"DATOS LABORALES DEL DEPORTISTA"]
[null,"CARGO:",null,{"$f":"UPPER(IF(Nómina!H23=\"\",\" \",Nómina!H23))","v":" "}]
[null,"CONDICIÓN LABORAL:",null,{"$f":"UPPER(IF(Nómina!I23=\"\",\" \",Nómina!I23))","v":" "}]
[null,"DOCUMENTO QUE ACREDITA VÍNCULO LABORAL",null,{"$f":"UPPER(IF(Nómina!J23=\"\",\" \",Nómina!J23))","v":" "},null,null,"N°:",{"$f":"UPPER(IF(Nómina!K23=\"\",\" \",Nómina!K23))","v":" "}]
[]
[null,"En caso de ser deportista invitado:"]
[null,"INSTITUCIÓN EDUCATIVA:",null,null,{"$f":"UPPER(IF(Nómina!L23=\"\",\" \",Nómina!L23))","v":" "}]
[]
[null,null,null,null,null,null,null,{"$f":"CONCATENATE(\"Puno, \",TEXT(TODAY(),\"dddd dd mmmm\"),\" del \",TEXT(TODAY(),\"yyy\"))","v":"Puno, miércoles 08 Mayo del 2019"}]
[]
[]
[]
[null,null,null,"______________________"]
[null,null,null,"Deportista"]
[null,null,null,{"$f":"PROPER(CONCATENATE(Nómina!D23,\" \",Nómina!B23,\" \",Nómina!C23))","v":"  "}]
[]
[]
[]
[null,"______________________",null,null,null,"______________________"]
[null,"Presidente del equipo",null,null,null,"Delegado del equipo"]
[null,{"$f":"PROPER(IF(Nómina!C35=\"\",\" \",Nómina!C35))","v":"Yo"},null,null,null,{"$f":"PROPER(IF(Nómina!G35=\"\",\" \",Nómina!G35))","v":"Tú"}]
[]
[]
[]
[null,null,null,"______________________"]
[null,null,null,"V°B° Director de IE"]
[null,null,null,{"$f":"PROPER(IF(Nómina!J35=\"\",\" \",Nómina!J35))","v":"Él"}]

{"sheet":"D14","index":14,"n_rows":40,"n_cols":8,"rows_kept":40,"cut":false,"hidden":true,"merged":[[7,1,7,7],[1,1,1,7],[2,1,2,7],[4,1,4,7],[5,1,5,3],[5,4,5,7],[8,1,8,2],[8,3,8,5],[9,1,9,2],[9,3,9,5],[10,1,10,2],[10,3,10,5],[25,3,25,5],[11,1,11,2],[11,3,11,5],[13,1,13,7],[14,1,14,2],[14,3,14,7],[15,1,15,2],[15,3,15,7],[16,1,16,2],[16,3,16,5],[18,1,18,3],[19,1,19,3],[19,4,19,7],[26,3,26,5],[27,3,27,5],[31,1,31,3],[31,5,31,7],[32,1,32,3],[32,5,32,7],[33,1,33,3],[33,5,33,7],[37,3,37,5],[38,3,38,5],[39,3,39,5]]}
[]
[]
[]
[]
[null,"FICHA DE INSCRIPCIÓN DE DEPORTISTA"]
[null,"INSTITUCIÓN EDUCATIVA:",null,null,{"$f":"UPPER(IF(Nómina!$D$8=\"\",\" \",Nómina!$D$8))","v":" "}]
[]
[null,"DATOS DEL DEPORTISTA"]
[null,"DNI N°:",null,{"$f":"IF(Nómina!E24=\"\",\" \",Nómina!E24)","v":" "}]
[null,"APELLIDOS:",null,{"$f":"CONCATENATE(Nómina!B24,\" \",Nómina!C24)","v":" "}]
[null,"NOMBRES:",null,{"$f":"IF(Nómina!D24=\"\",\" \",Nómina!D24)","v":" "}]
[null,"FECHA DE NACIMIENTO:",null,{"$f":"IF(Nómina!F24=\"\",\" \",Nómina!F24)","v":" "}]
[]
[null,"DATOS LABORALES DEL DEPORTISTA"]
[null,"CARGO:",null,{"$f":"UPPER(IF(Nómina!H24=\"\",\" \",Nómina!H24))","v":" "}]
[null,"CONDICIÓN LABORAL:",null,{"$f":"UPPER(IF(Nómina!I24=\"\",\" \",Nómina!I24))","v":" "}]
[null,"DOCUMENTO QUE ACREDITA VÍNCULO LABORAL",null,{"$f":"UPPER(IF(Nómina!J24=\"\",\" \",Nómina!J24))","v":" "},null,null,"N°:",{"$f":"UPPER(IF(Nómina!K24=\"\",\" \",Nómina!K24))","v":" "}]
[]
[null,"En caso de ser deportista invitado:"]
[null,"INSTITUCIÓN EDUCATIVA:",null,null,{"$f":"UPPER(IF(Nómina!L24=\"\",\" \",Nómina!L24))","v":" "}]
[]
[null,null,null,null,null,null,null,{"$f":"CONCATENATE(\"Puno, \",TEXT(TODAY(),\"dddd dd mmmm\"),\" del \",TEXT(TODAY(),\"yyy\"))","v":"Puno, miércoles 08 Mayo del 2019"}]
[]
[]
[]
[null,null,null,"______________________"]
[null,null,null,"Deportista"]
[null,null,null,{"$f":"PROPER(CONCATENATE(Nómina!D24,\" \",Nómina!B24,\" \",Nómina!C24))","v":"  "}]
[]
[]
[]
[null,"______________________",null,null,null,"______________________"]
[null,"Presidente del equipo",null,null,null,"Delegado del equipo"]
[null,{"$f":"PROPER(IF(Nómina!C35=\"\",\" \",Nómina!C35))","v":"Yo"},null,null,null,{"$f":"PROPER(IF(Nómina!G35=\"\",\" \",Nómina!G35))","v":"Tú"}]
[]
[]
[]
[null,null,null,"______________________"]
[null,null,null,"V°B° Director de IE"]
[null,null,null,{"$f":"PROPER(IF(Nómina!J35=\"\",\" \",Nómina!J35))","v":"Él"}]

{"sheet":"D15","index":15,"n_rows":40,"n_cols":8,"rows_kept":40,"cut":false,"hidden":true,"merged":[[7,1,7,7],[1,1,1,7],[2,1,2,7],[4,1,4,7],[5,1,5,3],[5,4,5,7],[8,1,8,2],[8,3,8,5],[9,1,9,2],[9,3,9,5],[10,1,10,2],[10,3,10,5],[25,3,25,5],[11,1,11,2],[11,3,11,5],[13,1,13,7],[14,1,14,2],[14,3,14,7],[15,1,15,2],[15,3,15,7],[16,1,16,2],[16,3,16,5],[18,1,18,3],[19,1,19,3],[19,4,19,7],[26,3,26,5],[27,3,27,5],[31,1,31,3],[31,5,31,7],[32,1,32,3],[32,5,32,7],[39,3,39,5],[33,1,33,3],[33,5,33,7],[37,3,37,5],[38,3,38,5]]}
[]
[]
[]
[]
[null,"FICHA DE INSCRIPCIÓN DE DEPORTISTA"]
[null,"INSTITUCIÓN EDUCATIVA:",null,null,{"$f":"UPPER(IF(Nómina!$D$8=\"\",\" \",Nómina!$D$8))","v":" "}]
[]
[null,"DATOS DEL DEPORTISTA"]
[null,"DNI N°:",null,{"$f":"IF(Nómina!E25=\"\",\" \",Nómina!E25)","v":" "}]
[null,"APELLIDOS:",null,{"$f":"CONCATENATE(Nómina!B25,\" \",Nómina!C25)","v":" "}]
[null,"NOMBRES:",null,{"$f":"IF(Nómina!D25=\"\",\" \",Nómina!D25)","v":" "}]
[null,"FECHA DE NACIMIENTO:",null,{"$f":"IF(Nómina!F25=\"\",\" \",Nómina!F25)","v":" "}]
[]
[null,"DATOS LABORALES DEL DEPORTISTA"]
[null,"CARGO:",null,{"$f":"UPPER(IF(Nómina!H25=\"\",\" \",Nómina!H25))","v":" "}]
[null,"CONDICIÓN LABORAL:",null,{"$f":"UPPER(IF(Nómina!I25=\"\",\" \",Nómina!I25))","v":" "}]
[null,"DOCUMENTO QUE ACREDITA VÍNCULO LABORAL",null,{"$f":"UPPER(IF(Nómina!J25=\"\",\" \",Nómina!J25))","v":" "},null,null,"N°:",{"$f":"UPPER(IF(Nómina!K25=\"\",\" \",Nómina!K25))","v":" "}]
[]
[null,"En caso de ser deportista invitado:"]
[null,"INSTITUCIÓN EDUCATIVA:",null,null,{"$f":"UPPER(IF(Nómina!L25=\"\",\" \",Nómina!L25))","v":" "}]
[]
[null,null,null,null,null,null,null,{"$f":"CONCATENATE(\"Puno, \",TEXT(TODAY(),\"dddd dd mmmm\"),\" del \",TEXT(TODAY(),\"yyy\"))","v":"Puno, miércoles 08 Mayo del 2019"}]
[]
[]
[]
[null,null,null,"______________________"]
[null,null,null,"Deportista"]
[null,null,null,{"$f":"PROPER(CONCATENATE(Nómina!D25,\" \",Nómina!B25,\" \",Nómina!C25))","v":"  "}]
[]
[]
[]
[null,"______________________",null,null,null,"______________________"]
[null,"Presidente del equipo",null,null,null,"Delegado del equipo"]
[null,{"$f":"PROPER(IF(Nómina!C35=\"\",\" \",Nómina!C35))","v":"Yo"},null,null,null,{"$f":"PROPER(IF(Nómina!G35=\"\",\" \",Nómina!G35))","v":"Tú"}]
[]
[]
[]
[null,null,null,"______________________"]
[null,null,null,"V°B° Director de IE"]
[null,null,null,{"$f":"PROPER(IF(Nómina!J35=\"\",\" \",Nómina!J35))","v":"Él"}]

{"sheet":"D16","index":16,"n_rows":40,"n_cols":8,"rows_kept":40,"cut":false,"hidden":true,"merged":[[7,1,7,7],[1,1,1,7],[2,1,2,7],[4,1,4,7],[5,1,5,3],[5,4,5,7],[8,1,8,2],[8,3,8,5],[9,1,9,2],[9,3,9,5],[10,1,10,2],[10,3,10,5],[25,3,25,5],[11,1,11,2],[11,3,11,5],[13,1,13,7],[14,1,14,2],[14,3,14,7],[15,1,15,2],[15,3,15,7],[16,1,16,2],[16,3,16,5],[18,1,18,3],[19,1,19,3],[19,4,19,7],[26,3,26,5],[27,3,27,5],[31,1,31,3],[31,5,31,7],[32,1,32,3],[32,5,32,7],[33,1,33,3],[33,5,33,7],[37,3,37,5],[38,3,38,5],[39,3,39,5]]}
[]
[]
[]
[]
[null,"FICHA DE INSCRIPCIÓN DE DEPORTISTA"]
[null,"INSTITUCIÓN EDUCATIVA:",null,null,{"$f":"UPPER(IF(Nómina!$D$8=\"\",\" \",Nómina!$D$8))","v":" "}]
[]
[null,"DATOS DEL DEPORTISTA"]
[null,"DNI N°:",null,{"$f":"IF(Nómina!E26=\"\",\" \",Nómina!E26)","v":" "}]
[null,"APELLIDOS:",null,{"$f":"CONCATENATE(Nómina!B26,\" \",Nómina!C26)","v":" "}]
[null,"NOMBRES:",null,{"$f":"IF(Nómina!D26=\"\",\" \",Nómina!D26)","v":" "}]
[null,"FECHA DE NACIMIENTO:",null,{"$f":"IF(Nómina!F26=\"\",\" \",Nómina!F26)","v":" "}]
[]
[null,"DATOS LABORALES DEL DEPORTISTA"]
[null,"CARGO:",null,{"$f":"UPPER(IF(Nómina!H26=\"\",\" \",Nómina!H26))","v":" "}]
[null,"CONDICIÓN LABORAL:",null,{"$f":"UPPER(IF(Nómina!I26=\"\",\" \",Nómina!I26))","v":" "}]
[null,"DOCUMENTO QUE ACREDITA VÍNCULO LABORAL",null,{"$f":"UPPER(IF(Nómina!J26=\"\",\" \",Nómina!J26))","v":" "},null,null,"N°:",{"$f":"UPPER(IF(Nómina!K26=\"\",\" \",Nómina!K26))","v":" "}]
[]
[null,"En caso de ser deportista invitado:"]
[null,"INSTITUCIÓN EDUCATIVA:",null,null,{"$f":"UPPER(IF(Nómina!L26=\"\",\" \",Nómina!L26))","v":" "}]
[]
[null,null,null,null,null,null,null,{"$f":"CONCATENATE(\"Puno, \",TEXT(TODAY(),\"dddd dd mmmm\"),\" del \",TEXT(TODAY(),\"yyy\"))","v":"Puno, miércoles 08 Mayo del 2019"}]
[]
[]
[]
[null,null,null,"______________________"]
[null,null,null,"Deportista"]
[null,null,null,{"$f":"PROPER(CONCATENATE(Nómina!D26,\" \",Nómina!B26,\" \",Nómina!C26))","v":"  "}]
[]
[]
[]
[null,"______________________",null,null,null,"______________________"]
[null,"Presidente del equipo",null,null,null,"Delegado del equipo"]
[null,{"$f":"PROPER(IF(Nómina!C35=\"\",\" \",Nómina!C35))","v":"Yo"},null,null,null,{"$f":"PROPER(IF(Nómina!G35=\"\",\" \",Nómina!G35))","v":"Tú"}]
[]
[]
[]
[null,null,null,"______________________"]
[null,null,null,"V°B° Director de IE"]
[null,null,null,{"$f":"PROPER(IF(Nómina!J35=\"\",\" \",Nómina!J35))","v":"Él"}]